﻿"Dublin Core:Title","Dublin Core:Alternative Title","Dublin Core:Subject","Dublin Core:Description","Dublin Core:Abstract","Dublin Core:Table Of Contents","Dublin Core:Creator","Dublin Core:Source","Dublin Core:Publisher","Dublin Core:Date","Dublin Core:Date Available","Dublin Core:Date Created","Dublin Core:Date Accepted","Dublin Core:Date Copyrighted","Dublin Core:Date Submitted","Dublin Core:Date Issued","Dublin Core:Date Modified","Dublin Core:Date Valid","Dublin Core:Contributor","Dublin Core:Rights","Dublin Core:Access Rights","Dublin Core:License","Dublin Core:Relation","Dublin Core:Conforms To","Dublin Core:Has Format","Dublin Core:Has Part","Dublin Core:Has Version","Dublin Core:Is Format Of","Dublin Core:Is Part Of","Dublin Core:Is Referenced By","Dublin Core:Is Replaced By","Dublin Core:Is Required By","Dublin Core:Is Version Of","Dublin Core:References","Dublin Core:Replaces","Dublin Core:Requires","Dublin Core:Format","Dublin Core:Extent","Dublin Core:Medium","Dublin Core:Language","Dublin Core:Type","Dublin Core:Identifier","Dublin Core:Bibliographic Citation","Dublin Core:Coverage","Dublin Core:Spatial Coverage","Dublin Core:Temporal Coverage","Dublin Core:Accrual Method","Dublin Core:Accrual Periodicity","Dublin Core:Accrual Policy","Dublin Core:Audience","Dublin Core:Audience Education Level","Dublin Core:Mediator","Dublin Core:Instructional Method","Dublin Core:Provenance","Dublin Core:Rights Holder","Item Type Metadata:Text","Item Type Metadata:Interviewer","Item Type Metadata:Interviewee","Item Type Metadata:Location","Item Type Metadata:Transcription","Item Type Metadata:Local URL","Item Type Metadata:Original Format","Item Type Metadata:Physical Dimensions","Item Type Metadata:Duration","Item Type Metadata:Compression","Item Type Metadata:Producer","Item Type Metadata:Director","Item Type Metadata:Bit Rate/Frequency","Item Type Metadata:Time Summary","Item Type Metadata:Email Body","Item Type Metadata:Subject Line","Item Type Metadata:From","Item Type Metadata:To","Item Type Metadata:CC","Item Type Metadata:BCC","Item Type Metadata:Number of Attachments","Item Type Metadata:Standards","Item Type Metadata:Objectives","Item Type Metadata:Materials","Item Type Metadata:Lesson Plan Text","Item Type Metadata:URL","Item Type Metadata:Event Type","Item Type Metadata:Participants","Item Type Metadata:Birth Date","Item Type Metadata:Birthplace","Item Type Metadata:Death Date","Item Type Metadata:Occupation","Item Type Metadata:Biographical Text","Item Type Metadata:Bibliography","Item Type Metadata:Transcript","Item Type Metadata:Viewer","Item Type Metadata:Narrator","Item Type Metadata:Production Team","Item Type Metadata:Display Resolution","Item Type Metadata:Frame Rate","Item Type Metadata:Player","Omeka Legacy File:Additional Creator","Omeka Legacy File:Transcriber","Omeka Legacy File:Producer","Omeka Legacy File:Render Device","Omeka Legacy File:Render Details","Omeka Legacy File:Capture Date","Omeka Legacy File:Capture Device","Omeka Legacy File:Capture Details","Omeka Legacy File:Change History","Omeka Legacy File:Watermark","Omeka Legacy File:Encryption","Omeka Legacy File:Compression","Omeka Legacy File:Post Processing","Omeka Image File:Width","Omeka Image File:Height","Omeka Image File:Bit Depth","Omeka Image File:Channels","Omeka Image File:Exif String","Omeka Image File:Exif Array","Omeka Image File:IPTC String","Omeka Image File:IPTC Array","Omeka Video File:Bitrate","Omeka Video File:Duration","Omeka Video File:Sample Rate","Omeka Video File:Codec","Omeka Video File:Width","Omeka Video File:Height","PDF Text:Text",Scripto:Transcription,tags,file,itemType,collection,public,featured
"Poster, Influenza Warning, 1918",,"University History","This poster warns people not to enter a specific area without permission from the Board of Health becuase of the Influenza outbreak.",,,,"150th Anniversary of Virginia Tech Collection",,1918,,,,,,,,,,"The copyright and related rights status of this Item has not been evaluated. Please contact Special Collections and University Archives for more information. You are free to use this Item in any way that is permitted by the copyright and related rights legislation that applies to your use. <a target=""_blank"" href=""http://rightsstatements.org/vocab/CNE/1.0/"" rel=""noreferrer noopener"">http://rightsstatements.org/vocab/CNE/1.0/</a>",,,,,,,,,"150th Anniversary of Virginia Tech Collection",,,,,,,,image/jpg,,,,Posters,"150th_076. Virginia flu 1918","Researchers wishing to cite this collection should include the following information: [identification of item], 150th Anniversary of Virginia Tech Collection, Special Collections and University Archives, Virginia Tech, Blacksburg, Va.",,,,,,,,,,,,"Special Collections and University Archives, Virginia Tech",,,,,,,,,,,,,,,,,,,,,,,,,,,,,,,,,,,,,,,,,,,,,,,,,,,,,,,,,,,,,,,,,,,,,,,,http://digitalsc.specomeka.vtlibraries.net/files/original/007d604dd7c50df68cf099ec13bd6057.jpg,"Still Image","150th Anniversary of Virginia Tech Collection",1,0
"Movie Poster, The Proud and the Profane, Paramount Pictures, 1956 (Ms2011-032)",,"Local/Regional History and Appalachian South","Movie poster for Paramount Pictures' 1956 film The Proud and the Profane, which was adapted from Lucy Herndon Crockett's book, The Magnificent Bastards.",,,,"<a href=""http://search.vaheritage.org/vivaxtf/view?docId=vt/viblbv00833.xml"" target=""_blank"" rel=""noreferrer"">See the Finding Aid for the Lucy Herndon Crockett Papers</a>",,1956,,,,,,,,,,,,,,,,,,,,,,,,,,,,,,,Posters,Ms2011-032_F02_The_Proud_and_Profane,"Researchers wishing to cite this collection should include the following information: Lucy Herndon Crockett Papers, Ms2011-032, Special Collections, Virginia Polytechnic Institute and State University, Blacksburg, Va.",,,,,,,,,,,,,,,,,,,,,,,,,,,,,,,,,,,,,,,,,,,,,,,,,,,,,,,,,,,,,,,,,,,,,,,,,,,,,,,,,,,,http://spec.lib.vt.edu/pickup/Omeka_upload/Ms2011-032_F02_The_Proud_and_Profane.jpg,Document,"Lucy Herndon Crockett Papers (Ms2011-032)",1,0
"Poster, Lambda Horizon Meeting Announcement, November 15, 1984 (Ms2014-010)",,"Lambda Horizon. (LGBTA of Virginia Tech)","Lambda Horizon poster advertising the group's upcoming meeting on November 15, 1984. Handwritten notes are on the back of the poster.",,,"Lambda Horizon. (LGBTA of Virginia Tech)","<a href=""http://ead.lib.virginia.edu/vivaxtf/view?docId=vt/viblbv00016.xml"" target=""_blank"">See the Finding Aid for the Mark A. Weber Papers</a>",,1984-11-15,,,,,,,,,,"<a href=""https://digitalsc.lib.vt.edu/files/thumbnails/spec_forms/PubPermission.doc"" target=""_blank"">Permission to publish material from the Mark A. Weber Papers must be obtained from Special Collections, Virginia Tech.</a>",,,,,,,,,"Box 1, Folder 24",,,,,,,,,,,English,Posters,Ms2014-010_WeberMark_PosterLambdaHorizonMeeting_1984_1115,"Researchers wishing to cite this collection should include the following information: Mark A. Weber Papers, Ms2014-010, Special Collections, Virginia Tech, Blacksburg, Va.",,,,,,,,,,,,"<a href=""http://spec.lib.vt.edu/"" target=""_blank"">Special Collections, University Libraries, Virginia Tech</a>",,,,,,,,,,,,,,,,,,,,,,,,,,,,,,,,,,,,,,,,,,,,,,,,,,,,,,,,,,,,,,,,,,,,,,,,"http://digitalsc.specomeka.vtlibraries.net/files/original/3387/Ms2014-010_WeberMark_PosterLambdaHorizonMeeting_1984_1115a.jpg,http://digitalsc.specomeka.vtlibraries.net/files/original/3387/Ms2014-010_WeberMark_PosterLambdaHorizonMeeting_1984_1115b.jpg",Document,"Mark A. Weber Papers (Ms2014-010)",1,0
"Poster, AIDS Education Forum, March 1, 1986 (Ms2014-010)",,"Lambda Horizon. (LGBTA of Virginia Tech)","Poster advertising the AIDS Education Forum held at Virginia Tech on march 1, 1986. (2 copies)",,,"Weber, Mark A.","<a href=""http://ead.lib.virginia.edu/vivaxtf/view?docId=vt/viblbv00016.xml"" target=""_blank"">See the Finding Aid for the&nbsp;Mark A. Weber Papers</a>",,1986-03-01,,,,,,,,,,"<a href=""https://digitalsc.lib.vt.edu/files/thumbnails/spec_forms/PubPermission.doc"" target=""_blank"">Permission to publish material from the Mark A. Weber Papers&nbsp;must be obtained from Special Collections, Virginia Tech.</a>",,,,,,,,,"Box 1, Folder 16",,,,,,,,,,,English,Posters,Ms2014-010_WeberMark_PosterAIDSEducation_1986_0301,"Researchers wishing to cite this collection should include the following information: Mark A. Weber Papers, Ms2014-010, Special Collections, Virginia Tech, Blacksburg, Va.",,,,,,,,,,,,"<a href=""http://spec.lib.vt.edu/"" target=""_blank"">Special Collections, University Libraries, Virginia Tech</a>",,,,,,,,,,,,,,,,,,,,,,,,,,,,,,,,,,,,,,,,,,,,,,,,,,,,,,,,,,,,,,,,,,,,,,,,http://digitalsc.specomeka.vtlibraries.net/files/original/3385/Ms2014-010_WeberMark_PosterAIDSEducation_1986_0301.jpg,Document,"Mark A. Weber Papers (Ms2014-010)",1,0
"Sensational Foods poster",,"Ann Hertzler Children's Cookbooks and Nutrition Literature Collection","Poster includes nutrition information sheets for parents on the verso.",,,"Scholastic, Inc.","<a href=""http://ead.lib.virginia.edu/vivaxtf/view?docId=vt/viblbv00716.xml"" target=""_blank"">Ann A. Hertzler Collection</a>","Scholastic, Inc.",1995,,,,,,,,,,"Permission to publish material from Ann A. Hertzler Collection must be obtained from Special Collections, Virginia Tech.","Collection is open for research.",,,,,,,,"Ms2011-004, Folder 1",,,,,,,,,,,English,Posters,Ms2001_004_SensationalFood,"Researchers wishing to cite this collection should include the following information: Ann A. Hertzler Collection, Ms2001-004, Special Collections, Virginia Tech, Blacksburg, Va.",,,,,,,,,,,,"Special Collections, Virginia Tech, Blacksburg, Va.",,,,,,,,,,,,,,,,,,,,,,,,,,,,,,,,,,,,,,,,,,,,,,,,,,,,,,,,,,,,,,,,,,,,,,,,http://digitalsc.specomeka.vtlibraries.net/files/original/518a29678d5d2e8a35f2d173a5a8fd75.jpg,"Still Image","Ann A. Hertzler Collection (Ms2001-004)",1,0
"Poster, Lambda Horizon, ""'Til the Cock Crows Party"", April 11, [no year] (Ms2014-010)",,"Lambda Horizon. (LGBTA of Virginia Tech)","Poster promoting a ""'Til the Cock Crows Party"" hosted by Lambda Horizon on Aril 11th (no year given on poster).",,,"Weber, Mark A.","<a href=""http://ead.lib.virginia.edu/vivaxtf/view?docId=vt/viblbv00016.xml"" target=""_blank"">See the Finding Aid for the Mark A. Weber Papers</a>",,2015-04-11,,,,,,,,,,"<a href=""https://digitalsc.lib.vt.edu/files/thumbnails/spec_forms/PubPermission.doc"" target=""_blank"">Permission to publish material from the Mark A. Weber Papers must be obtained from Special Collections, Virginia Tech.</a>",,,,,,,,,"Box 1, Folder 24",,,,,,,,,,,English,Posters,Ms2014-010_WeberMark_PosterLambdaHorizonParty__0411,"Researchers wishing to cite this collection should include the following information: Mark A. Weber Papers, Ms2014-010, Special Collections, Virginia Tech, Blacksburg, Va.",,,,,,,,,,,,"<a href=""http://spec.lib.vt.edu/"" target=""_blank"">Special Collections, University Libraries, Virginia Tech</a>",,,,,,,,,,,,,,,,,,,,,,,,,,,,,,,,,,,,,,,,,,,,,,,,,,,,,,,,,,,,,,,,,,,,,,,,http://digitalsc.specomeka.vtlibraries.net/files/original/3388/Ms2014-010_WeberMark_PosterLambdaHorizonParty_0411.jpg,Document,"Mark A. Weber Papers (Ms2014-010)",1,0
"Poster from Virginia Law Enforcement",,"April 16, 2007 shootings","One painted plywood display with law enforcement badges attached",,,"Virginia Law Enforcement","<a href=""https://ead.lib.virginia.edu/vivaxtf/view?docId=oai/lib.vt.edu/repositories/2/resources/2341.oai_ead.xml"" target=""_blank"" rel=""noreferrer noopener"">See the finding aid for the Virginia Tech April 16, 2007 Archives of the University Libraries</a>",,"circa 2007",,,,,,,,,,"The copyright and related rights status of this Item has not been evaluated. Please contact Special Collections and University Archives for more information. You are free to use this Item in any way that is permitted by the copyright and related rights legislation that applies to your use. <a target=""_blank"" href=""http://rightsstatements.org/vocab/CNE/1.0/"">http://rightsstatements.org/vocab/CNE/1.0/</a>",,,,,,,,,"Ms2008-020, P00565",,,,,,,,jpeg,,,,Posters,Ms2008-020_P00565,"Researchers wishing to cite this collection should include the following information: [identification of item], [box], [folder], Virginia Tech April 16, 2007 Archives of the University Libraries, Ms2008-020, Special Collections and University Archives, Virginia Tech, Blacksburg, Va.",,,,,,,,,,,,"Special Collections and University Archives, Virginia Tech",,,,,,,,,,,,,,,,,,,,,,,,,,,,,,,,,,,,,,,,,,,,,,,,,,,,,,,,,,,,,,,,,,,,,,,,http://digitalsc.specomeka.vtlibraries.net/files/original/eff98d45d963fb131e2e783b16692023.jpg,,"Virginia Tech April 16, 2007 Archives of the University Libraries (MS2008-020)",1,0
"Event Poster, Lambda Horizon, n.d. (Ms2014-010)",,"Lambda Horizon. (LGBTA of Virginia Tech)","Poster advertising an upcoming Lambda Horizon event. The group's campus phone number and contact information is listed on the poster.",,,"Lambda Horizon. (LGBTA of Virginia Tech)","<a href=""http://ead.lib.virginia.edu/vivaxtf/view?docId=vt/viblbv00016.xml"" target=""_blank"">See the Finding Aid for the&nbsp;Mark A. Weber Papers</a>",,n.d.,,,,,,,,,,"<a href=""https://digitalsc.lib.vt.edu/files/thumbnails/spec_forms/PubPermission.doc"" target=""_blank"">Permission to publish material from the Mark A. Weber Papers&nbsp;must be obtained from Special Collections, Virginia Tech.</a>",,,,,,,,,"Box 1, Folder 24",,,,,,,,,,,English,Posters,Ms2014-010_WeberMark_PosterLambdaHorizonEvents_nd,"Researchers wishing to cite this collection should include the following information: Mark A. Weber Papers, Ms2014-010, Special Collections, Virginia Tech, Blacksburg, Va.",,,,,,,,,,,,"<a href=""http://spec.lib.vt.edu/"" target=""_blank"">Special Collections, University Libraries, Virginia Tech</a>",,,,,,,,,,,,,,,,,,,,,,,,,,,,,,,,,,,,,,,,,,,,,,,,,,,,,,,,,,,,,,,,,,,,,,,,http://digitalsc.specomeka.vtlibraries.net/files/original/3386/Ms2014-010_WeberMark_PosterLambdaHorizonEvents_nd.jpg,Document,"Mark A. Weber Papers (Ms2014-010)",1,0
"Poster, Lambda Horizon, n.d. (Ms2014-010)",,"Lambda Horizon. (LGBTA of Virginia Tech)","Poster offering information about Virginia Tech's gay and lesbian student group Lmabda Horizon.",,,"Weber, Mark A.","<a href=""http://ead.lib.virginia.edu/vivaxtf/view?docId=vt/viblbv00016.xml"" target=""_blank"">See the Finding Aid for the Mark A. Weber Papers</a>",,n.d.,,,,,,,,,,"<a href=""https://digitalsc.lib.vt.edu/files/thumbnails/spec_forms/PubPermission.doc"" target=""_blank"">Permission to publish material from the Mark A. Weber Papers must be obtained from Special Collections, Virginia Tech.</a>",,,,,,,,,"Box 1, Folder 24",,,,,,,,,,,English,Posters,Ms2014-010_WeberMark_PosterLambdaHorizon_nd,"Researchers wishing to cite this collection should include the following information: Mark A. Weber Papers, Ms2014-010, Special Collections, Virginia Tech, Blacksburg, Va.",,,,,,,,,,,,"<a href=""http://spec.lib.vt.edu/"" target=""_blank"">Special Collections, University Libraries, Virginia Tech</a>",,,,,,,,,,,,,,,,,,,,,,,,,,,,,,,,,,,,,,,,,,,,,,,,,,,,,,,,,,,,,,,,,,,,,,,,http://digitalsc.specomeka.vtlibraries.net/files/original/3389/Ms2014-010_WeberMark_PosterLambdaHorizon_nd.jpg,Document,"Mark A. Weber Papers (Ms2014-010)",1,0
"Versatile Vegetables poster",,"Ann Hertzler Children's Cookbooks and Nutrition Literature Collection",,,,,"<a href=""http://ead.lib.virginia.edu/vivaxtf/view?docId=vt/viblbv00716.xml"" target=""_blank"">Ann A. Hertzler Collection</a>",,n.d.,,,,,,,,,,"Permission to publish material from Ann A. Hertzler Collection must be obtained from Special Collections, Virginia Tech.","Collection is open for research.",,,,,,,,"Ms2001-004, Folder 1",,,,,,,,,,,English,Posters,Ms2001_004_VersatileVegetables,"Researchers wishing to cite this collection should include the following information: Ann A. Hertzler Collection, Ms2001-004, Special Collections, Virginia Tech, Blacksburg, Va.",,,,,,,,,,,,"Special Collections, Virginia Tech, Blacksburg, Va.",,,,,,,,,,,,,,,,,,,,,,,,,,,,,,,,,,,,,,,,,,,,,,,,,,,,,,,,,,,,,,,,,,,,,,,,http://digitalsc.specomeka.vtlibraries.net/files/original/6e8872bc1d022ce267c42cf7e147530e.jpg,"Still Image","Ann A. Hertzler Collection (Ms2001-004)",1,0
"Lets go Hokies! Poster, P00179 (Ms2008-020)",,"April 16, 2007 shootings","Poster that says, ""Lets go Hokies! VT Believe in what you feel! HDH Help Don't Hurt!""",,,,"<a href=""http://ead.lib.virginia.edu/vivaxtf/view?docId=vt/viblbv00656.xml"">See the finding aid for the Virginia Tech April 16, 2007 Archives of the University Libraries</a>.",,undated,,,,,,,,,,"This Item is protected by copyright and/or related rights. However, for this Item, either (a) no rights-holder(s) have been identified or (b) one or more rights-holder(s) have been identified but none have been located. You are free to use this Item in any way that is permitted by the copyright and related rights legislation that applies to your use. <a href=""%E2%80%9Dhttps%3A//rightsstatements.org/page/InC-RUU/1.0/?language=en%E2%80%9D"">https://rightsstatements.org/page/InC-RUU/1.0/?language=en</a>",,,,,,,,,"Ms2008-020, Box 289",,,,,,,,,,,English,Posters,Ms2008_020_April162007Archives_B289_P00179_Poster_Undated.jpg,"Researchers wishing to cite this collection should include the following information: Virginia Tech April 16, 2007 Archives of the University Libraries, Ms2008-020, Special Collections and University Archives, Virginia Tech, Blacksburg, Va.",,,,,,,,,,,,"Special Collections and University Archives, Virginia Tech",,,,,,,,,,,,,,,,,,,,,,,,,,,,,,,,,,,,PDF,,,,,,,,,,,,,,,,,,,,,,,,,,,,,,,,,,,,http://digitalsc.specomeka.vtlibraries.net/files/original/1350c5b7bdaf0c8712d121f4aa64b7ad.jpg,Document,"Virginia Tech April 16, 2007 Archives of the University Libraries (MS2008-020)",1,0
"VT We Mourn With You, poster, P00190 (Ms2008-020)",,"April 16, 2007 shootings","Poster that says ""VT We Mourn With You"" and includes messages and signatures from unknown institution.",,,,"<a href=""http://ead.lib.virginia.edu/vivaxtf/view?docId=vt/viblbv00656.xml"">See the finding aid for the Virginia Tech April 16, 2007 Archives of the University Libraries</a>.",,undated,,,,,,,,,,"This Item is protected by copyright and/or related rights. However, for this Item, either (a) no rights-holder(s) have been identified or (b) one or more rights-holder(s) have been identified but none have been located. You are free to use this Item in any way that is permitted by the copyright and related rights legislation that applies to your use. <a href=""%E2%80%9Dhttps%3A//rightsstatements.org/page/InC-RUU/1.0/?language=en%E2%80%9D"">https://rightsstatements.org/page/InC-RUU/1.0/?language=en</a>",,,,,,,,,"Ms2008-020, Box 290",,,,,,,,,,,English,Posters,Ms2008_020_April162007Archives_B290_P00190_Poster_Undated.jpg,"Researchers wishing to cite this collection should include the following information: Virginia Tech April 16, 2007 Archives of the University Libraries, Ms2008-020, Special Collections and University Archives, Virginia Tech, Blacksburg, Va.",,,,,,,,,,,,"Special Collections and University Archives, Virginia Tech",,,,,,,,,,,,,,,,,,,,,,,,,,,,,,,,,,,,PDF,,,,,,,,,,,,,,,,,,,,,,,,,,,,,,,,,,,,http://digitalsc.specomeka.vtlibraries.net/files/original/b9e00b152a60a5afca17100338434802.jpg,Document,"Virginia Tech April 16, 2007 Archives of the University Libraries (MS2008-020)",1,0
"VT poster with children's photos, P00048 (Ms2008-020)",,"April 16, 2007 shootings","Poster with orange VT and photographs of chidren with their first names and messages.",,,,"<a href=""http://ead.lib.virginia.edu/vivaxtf/view?docId=vt/viblbv00656.xml"">See the finding aid for the Virginia Tech April 16, 2007 Archives of the University Libraries</a>.",,undated,,,,,,,,,,"This Item is protected by copyright and/or related rights. However, for this Item, either (a) no rights-holder(s) have been identified or (b) one or more rights-holder(s) have been identified but none have been located. You are free to use this Item in any way that is permitted by the copyright and related rights legislation that applies to your use. <a href=""%E2%80%9Dhttps%3A//rightsstatements.org/page/InC-RUU/1.0/?language=en%E2%80%9D"">https://rightsstatements.org/page/InC-RUU/1.0/?language=en</a>",,,,,,,,,"Ms2008-020, Box 301",,,,,,,,,,,English,Posters,Ms2008_020_April162007Archives_B301_P00048_Poster_Undated.jpg,"Researchers wishing to cite this collection should include the following information: Virginia Tech April 16, 2007 Archives of the University Libraries, Ms2008-020, Special Collections and University Archives, Virginia Tech, Blacksburg, Va.",,,,,,,,,,,,"Special Collections and University Archives, Virginia Tech",,,,,,,,,,,,,,,,,,,,,,,,,,,,,,,,,,,,PDF,,,,,,,,,,,,,,,,,,,,,,,,,,,,,,,,,,,,http://digitalsc.specomeka.vtlibraries.net/files/original/811c354fd37aa05f6af21acd7494f834.jpg,Document,"Virginia Tech April 16, 2007 Archives of the University Libraries (MS2008-020)",1,0
"We will never forget poster with poem, P00526 (Ms2008-020)",,"April 16, 2007 shootings","Poster with pictures of Norris Hall and a black VT ribbon, a poem, and the names of the 32 victims.",,,,"<a href=""http://ead.lib.virginia.edu/vivaxtf/view?docId=vt/viblbv00656.xml"">See the finding aid for the Virginia Tech April 16, 2007 Archives of the University Libraries</a>.",,undated,,,,,,,,,,"This Item is protected by copyright and/or related rights. However, for this Item, either (a) no rights-holder(s) have been identified or (b) one or more rights-holder(s) have been identified but none have been located. You are free to use this Item in any way that is permitted by the copyright and related rights legislation that applies to your use. <a href=""%E2%80%9Dhttps%3A//rightsstatements.org/page/InC-RUU/1.0/?language=en%E2%80%9D"">https://rightsstatements.org/page/InC-RUU/1.0/?language=en</a>",,,,,,,,,"Ms2008-020, Box 301",,,,,,,,,,,English,Posters,Ms2008_020_April162007Archives_B301_P00526_Poster_Undated.jpg,"Researchers wishing to cite this collection should include the following information: Virginia Tech April 16, 2007 Archives of the University Libraries, Ms2008-020, Special Collections and University Archives, Virginia Tech, Blacksburg, Va.",,,,,,,,,,,,"Special Collections and University Archives, Virginia Tech",,,,,,,,,,,,,,,,,,,,,,,,,,,,,,,,,,,,PDF,,,,,,,,,,,,,,,,,,,,,,,,,,,,,,,,,,,,http://digitalsc.specomeka.vtlibraries.net/files/original/565afa0f6a6a6718d5be88304b453435.jpg,Document,"Virginia Tech April 16, 2007 Archives of the University Libraries (MS2008-020)",1,0